{"text_format":"1","workbook":"xlsx","n_sheets":5,"sheets":["Front","Valuables","MagicItems","Weapons&Armour","ObjectiveTreasure"],"not_rendered":{"charts":0,"images":0,"macros":1,"external_links":0,"defined_names":0,"comments":0,"pivot_tables":0},"unopened":[],"bounds":{"document_bytes":16777216,"sheet_cells":100000,"rows_first":2000,"rows_last":500,"rows_between":2000,"halvings":0,"cell_chars":16384,"cell_head_chars":4096},"cells_cut":0,"cells_raw":0,"read":"whole","date_system":"1900"}

{"sheet":"Front","index":0,"n_rows":5,"n_cols":7,"rows_kept":5,"cut":false,"hidden":false,"merged":[]}
[null,"Treasure Type","Table Roll","Item Roll","Item","Details","Value"]
[{"$f":"RANDBETWEEN(1,3)","v":2},{"$f":"IF(A2=1,\"Valuables\",\"None Of This Type\")","v":"None Of This Type"},{"$f":"RANDBETWEEN(1,6)","v":5},{"$f":"RANDBETWEEN(1,36)","v":27},{"$f":"IF(C2>=4,VLOOKUP($D$2,Valuables!$A$9:$D$44,2,TRUE),VLOOKUP($C$2,Valuables!$A$1:$C$6,2,TRUE))","v":"Incense of Araby"},{"$f":"IF(C2>=4,VLOOKUP($D$2,Valuables!$A$9:$D$44,3,TRUE),VLOOKUP($C$2,Valuables!$A$1:$C$6,3,TRUE))","v":"Rare and expensive incense is found, worth D6x50 gold"},{"$f":"IF(C2>=4,VLOOKUP($D$2,Valuables!$A$9:$D$44,4,TRUE),VLOOKUP($C$2,Valuables!$A$1:$D$6,4,TRUE))","v":"Var"}]
[null,{"$f":"IF(A2=2, \"MagicItems\", \"None Of This Type\")","v":"MagicItems"},null,null,{"$f":"IF($C$2=1,\"SCROLL\",IF($C$2=2,VLOOKUP(($D$2+($C$2-2)*36),MagicItems!$A$10:$D$153,2,TRUE),IF($C$2=3,VLOOKUP(($D$2+($C$2-2)*36),MagicItems!$A$10:$D$153,2,TRUE),IF($C$2=4,VLOOKUP(($D$2+($C$2-2)*36),MagicItems!$A$10:$D$153,2,TRUE),IF($C$2=5,VLOOKUP(($D$2+($C$2-2)*36),MagicItems!$A$10:$D$153,2,TRUE),IF($C$2=6,\"REROLL\"))))))","v":"Collar of Zorga"},{"$f":"IF($C$2=1,\"SCROLL\",IF($C$2=2,VLOOKUP(($D$2+($C$2-2)*36),MagicItems!$A$10:$D$153,3,TRUE),IF($C$2=3,VLOOKUP(($D$2+($C$2-2)*36),MagicItems!$A$10:$D$153,3,TRUE),IF($C$2=4,VLOOKUP(($D$2+($C$2-2)*36),MagicItems!$A$10:$D$153,3,TRUE),IF($C$2=5,VLOOKUP(($D$2+($C$2-2)*36),MagicItems!$A$10:$D$153,3,TRUE),IF($C$2=6,\"REROLL\"))))))","v":"While worn, no monster will initiate combat in hand to hand against the wearer, but will defend themselves."},{"$f":"IF($C$2=1,\"SCROLL\",IF($C$2=2,VLOOKUP(($D$2+($C$2-2)*36),MagicItems!$A$10:$D$153,4,TRUE),IF($C$2=3,VLOOKUP(($D$2+($C$2-2)*36),MagicItems!$A$10:$D$153,4,TRUE),IF($C$2=4,VLOOKUP(($D$2+($C$2-2)*36),MagicItems!$A$10:$D$153,4,TRUE),IF($C$2=5,VLOOKUP(($D$2+($C$2-2)*36),MagicItems!$A$10:$D$153,4,TRUE),IF($C$2=6,\"REROLL\"))))))","v":500}]
[null,{"$f":"IF(A2=3, \"Weapons&Armour\", \"None Of This Type\")","v":"None Of This Type"},{"$f":"RANDBETWEEN(1,36)","v":11},{"$f":"D2","v":27},{"$f":"IF($C$4<=10,VLOOKUP($D$4,'Weapons&Armour'!$A$1:$D$36, 2,TRUE),IF(AND($C$4>=11,$C$4<=26),VLOOKUP($D$4,'Weapons&Armour'!$A$37:$D$72, 2,TRUE),VLOOKUP($D$4,'Weapons&Armour'!$A$73:$D$108, 2,TRUE)))","v":"Sword of Might"},{"$f":"IF($C$4<=10,VLOOKUP($D$4,'Weapons&Armour'!$A$1:$D$36, 3,TRUE),IF(AND($C$4>=11,$C$4<=26),VLOOKUP($D$4,'Weapons&Armour'!$A$37:$D$72, 3,TRUE),VLOOKUP($D$4,'Weapons&Armour'!$A$73:$D$108, 3,TRUE)))","v":"+1 Strength"},{"$f":"IF($C$4<=10,VLOOKUP($D$4,'Weapons&Armour'!$A$1:$D$36, 4,TRUE),IF(AND($C$4>=11,$C$4<=26),VLOOKUP($D$4,'Weapons&Armour'!$A$37:$D$72, 4,TRUE),VLOOKUP($D$4,'Weapons&Armour'!$A$73:$D$108, 4,TRUE)))","v":"150"}]
[null,"Objective Room",null,{"$f":"RANDBETWEEN(1,72)","v":17},{"$f":"VLOOKUP($D$5,ObjectiveTreasure!$A$2:$D$73,2,TRUE)","v":"Crown of Sorcery"},{"$f":"VLOOKUP($D$5,ObjectiveTreasure!$A$2:$D$73,3,TRUE)","v":"Usable only by non-spell casters.  When found, randomly select two spells at the bearers BL in casting number.  Each turn the wearer gains the POW of the dungeon, +1, and can cast up to his BL in spells in a turn.  Each time a spell is cast, roll a D6: 1 = spell fails and wearer is immobilized for the turn (only a 1 misses)."},{"$f":"VLOOKUP($D$5,ObjectiveTreasure!$A$2:$D$73,4,TRUE)","v":1000}]

{"sheet":"Valuables","index":1,"n_rows":44,"n_cols":4,"rows_kept":44,"cut":false,"hidden":true,"merged":[]}
[1,"Gold","Roll as many D6 as desired, and multiply the total by (10xdungeon level).  However, if any 1's are rolled on the dice, nothing is found.","var"]
[2,"Gold","Roll as many D6 as desired, and multiply the total by (10xdungeon level).  However, if any 1's are rolled on the dice, nothing is found.","var"]
[3,"Gold","Roll as many D6 as desired, and multiply the total by (10xdungeon level).  However, if any 1's are rolled on the dice, nothing is found.","var"]
[4,"Commodities","Roll on the Commodities chart below","var"]
[5,"Commodities","Roll on the Commodities chart below","var"]
[6,"Commodities","Roll on the Commodities chart below","var"]
[]
[]
[1,"Map","A secret door is shown in the next room the Warriors come to, put a door on the side of the room and resolve two events, then take two treasures in addition to the monster's loot.","--"]
[2,"Potion of Alchemy","Worth D6x40 gold to alchemist, if an alchemist is in the party, can be used to make potion of choice.","D6x40"]
[3,"Hidden Alcove","Roll as many D6 as desired for the part, if any come up a 1 then nothing is found, but an event is resolved due to the noise.  If any come up 2-5, then add them up and find that number times 10 in gold.  For each 6, a treasure is found!","Var"]
[4,"Pearl Necklace","Roll as many D6 as desired, multiply the result by 10, but if any 1s result, the shop refuses to buy, and another settlement must be tried","Var"]
[5,"Exotic foods of Tilea","A rare delicacy",50]
[6,"Spices from Araby","Expensive spices and goods from afar worth D3x100 gold","var"]
[7,"Ancient Vase of Lustria","Odd and unusable, but fascinating",175]
[8,"Fine Clothes","D6 pieces of clothing fit for a king","25@"]
[9,"Quarg Horn","Usable only during the Quarg Hunt Settlement Event.  During the hunt, roll D6: 1-5 = no effect, 6 = a quarg shows up , worth 1000 gold!",1000]
[10,"Holy Artefact","At a temple, the priests will pay D6x100 gold for the artefact, but if a 1 is rolled, they give you nothing here, but another temple in another settlement may buy it.","var"]
[11,"Wines of Bretonnia","Noble wine worth D6x100 gold","Var"]
[12,"Ulathan Wine","Fine elven wine worth D6x125 gold","Var"]
[13,"Tankard","A Dwarven Tankard that no dwarf would ever part with",20]
[14,"Dwarf Pick","Can clear away debris and rubble in D6 turns, but after each successful use, roll a D6: 1 = the pick breaks and is destroyed.",125]
[15,"Precious Icon","Worth D6x200 gold to elders in a Village (not a town of city)","Var"]
[16,"Abandoned Backpack","D3 treasure items in the pack, but what happened to the warrior wearing it?","Var"]
[17,"Fine Gold Elf Wine","A bottle heals D3 wounds, but makes the Warrior -1 to hit for D3 turns.  D6 bottles are found worth 100 Gold","var"]
[18,"Silks of Cathay","A bolt of silk, stored in a chest is found, worth D6x25 gold","Var"]
[19,"Provisions","D6 Provisions are discovered, each heals 2 wounds and are exactly like provisions that can be purchased in settlements",0]
[20,"Bandages","D6 Bandages are discovered, each heals 3 wounds and are exactly like bandages that can be purchased in settlements"]
[21,"Tapestries of Bretonia","Fine Tapestries are found here, and can be sold at the next settlement for D6x50 gold","Var"]
[22,"Jewelry","The Monsters had fine jewelry hidden away, worth D6x50 gold in the next settlement.","Var"]
[23,"Dinner Wear","Flatwear, goblets, plates, and such fit for a king is found, worth D6x25 gold the next settlement.","Var"]
[24,"Ceremonial Armor","+1 Toughness, any attack that rolls a natural 6 for damage destroys the armor if worn, but is worth 150 gold in the settlement.","150"]
[25,"Elven Cooking Herbs","Rare spices and herbs from Ulathan, dried and preserved in wax packets, worth 2D6x25 gold","Var"]
[26,"Carpets from far Cathay","Oriental rugs are stacked here, D6 of them worth D6x10 gold each.","Var"]
[27,"Incense of Araby","Rare and expensive incense is found, worth D6x50 gold","Var"]
[28,"Ingots of Iron","D6 iron ingots are discovered with Dwarven marks on them, worth D6x30 gold each","Var"]
[29,"Ingots of Silver","D3 silver ingots are discovered, pure silver worth D3x100 gold each","Var"]
[30,"Ingots of Gold","D3 gold ingots are found!  Roll 3D6 for each separately, if any of the 3D6 rolls results in doubles, they are painted lead, but otherwise multiply the result by 25 for the gold value","Var"]
[31,"Musical Instruments","Stored here are D6 musical instruments, worth D6x10 gold in a village, double that in a town, and triple that in a city (D6x30 in a city).","Var"]
[32,"Books","Various books and bound leaves of writing are here, none magical, but valuable none the less",300]
{"$rows_left_out":5}
{"sheet":"MagicItems","index":2,"n_rows":153,"n_cols":6,"rows_kept":153,"cut":false,"hidden":true,"merged":[]}
[1,"Scroll","Scroll: Randomly determine a spell from the Wizard’s spell list ","VAR"]
[2,"Potions and Trinkets Table"]
[3,"One Use Minor Magic Items Table"]
[4,"Minor Magic Items Table"]
[5,"Jewelry Table"]
[6,"Choose one from the five results above."]
[]
[null,"POTIONS and TRINKETS"]
[]
[1,"Madcap Potion","Grants x2 attacks when taken, until a 1 is rolled for POW, at which point the drinker is reduced to 1 Initiative and 1 attack for D6 turns.",100,11]
[2,"Skalm","Roll a D6 when drank: 1 = does 1D6 wounds with no modifiers, 2-6 = Heals all wounds",50]
[3,"Potion of Knowledge","Spells cost 0 POW, each turn roll a D6: 1-2 = wears off + roll a D6, on a 1 all magic ability is lost until the end of the adventure.",200]
[4,"Potion of Healing","Heals D6 wounds",75]
[5,"Healing Balm","Heals all wounds lost",200]
[6,"Potion of Levitation","Lasts one turn.  Ignore pits, chasms etc, all attacks are –1 to hit drinker.",250]
[7,"Magic Potion","When imbibed, roll D6: 1 = lose 2D6 wounds, 2 = lose 1D6 wounds, 3 = skin is rainbow striped, 4 = heals 1D6 wounds, 5 = heals 2D6 wounds, 6 = heals all wounds",60]
[8,"Salve of Strength","Gives +1 Strength for D6 turns",100]
[9,"Potion of Strength","Gives D6 Strength for one turn",150]
[10,"Holy Water","Roll to hit with BS, does D6 wounds to any undead, chaos, or daemon creature (and D3 to any such creature adjacent to the target) with no modifiers.",250]
[11,"Potion of Flying","For one turn, can move D6+2 squares, fly over all obstacles, and cannot be pinned.",150]
[12,"Potion of Lightning Blades","+1 to hit per Battle-Level for one turn","500"]
[13,"Potion of Endurance","Can ignore one blow that would otherwise kill him",300]
[14,"Incense of Healing","When opened, heals every warrior on the same board section 2D6 wounds and is expended.",200]
[15,"Potion of Pain","Heals 2D6 wounds and allows drinker to ignore one blow that would otherwise kill him",300]
[16,"Potion of Battle","+1 attack for one turn","75"]
[17,"Potion of Weapon Mastery","+2 to hit and damage is +2D6 wounds for one turn","150"]
[18,"Undead Bane","Enough for 1 weapon for 1 turn, causes an additional 1 wound per Battle-Level damage to undead",50]
[19,"Chaos Bane","Enough for 1 weapon for 1 turn, causes an additional 1 wound per Battle-Level damage to Chaos creatures",200]
[20,"Potion of Toughness ","+1 toughness until end of turn","75"]
[21,"Potion of Instability","For one turn, cannot be pinned, cast spells, attack, be attacked, or be the target of any traps, magic, etc.",200]
[22,"Potion of Keensight","For one turn, may make as many bow attacks as the drinker has attacks",250]
[23,"Bugmans XXXXXX","4 doses: heals D6 wounds, but is –3 to hit next D3 turns, each use reduces gold value 50 gp",200]
[24,"Potion of Invisibility","For one turn, cannot be pinned, cannot be attacked or targeted by magic, cannot cast spells, but can attack",200]
[25,"Potion of Disguise","For one turn, monsters will ignore and will not pin the drinker unless he attacks them",100]
[26,"Arkal’s Powder","For one turn, can move 3D6 squares and cannot be pinned",100]
[27,"Healing Herbs","Elf or alchemist can make D6 healing potions from this between adventures",300]
[28,"Poison","Enough for one weapon, lasts one battle.  If the weapon causes damage, it does an additional D3 wounds at the end of turn",150]
[29,"Potion of Erupting","Does D6 damage with no modifiers to any square within 2x the thrower’s Strength.",75]
[30,"Firebomb","D6 found, Does D6 damage to any 2x2 area, no modifiers",100]
[31,"Flash Powder","D3 found, gives +1 attack to the Warriors that turn, only one per turn can be used",75]
{"$rows_left_out":114}
{"sheet":"Weapons&Armour","index":3,"n_rows":108,"n_cols":4,"rows_kept":108,"cut":false,"hidden":true,"merged":[]}
[1,"Armor of Brilliance","3 DEF, -1 to be hit",400]
[2,"Armor of Protection","3 DEF, 5+ dodge ",500]
[3,"Dragon Shield","Once per adventure, the bearer is immune to any one attack",300]
[4,"Chaos Armor","3 DEF, can cast spells with it on",500]
[5,"Chaos Runeshield","1 armor, negates all magic items used adjacent (except self and chaos armor) including wearer",200]
[6,"Spellshield","2 armor, 4+ magic resistance.  If the spell is resisted, it reflects and affects the caster.",400]
[7,"Bane Shield","1 armor, 5+ dodge.  Any attack dodged reflects on the attacker",300]
[8,"Charmed Shield","2 armor, removes 1 attack from the monster attacking wielder",300]
[9,"Magic Warpaint","1 adventure’s worth.  2 armor vs missiles, 3 vs hand to hand, can use magic with it on but cannot be combined with armor",200]
[10,"Fanged Death Helm","Choose one attack per turn, if it hits, an additional bite attack of D6 wounds that always hits, with no modifiers.",250]
[11,"Armor of Fortune","Absorbs 30 wounds, which never affect the wearer until the 30 is reached.  The armor then explodes, taking the wearer to 0 wounds.",500]
[12,"Shield of Deliverance","Can totally absorb two blows, then is destroyed.",500]
[13,"Helm of Alcadizzar","Acts as a lantern, gives +1 toughness, and all undead are –1 to hit the wearer.",450]
[14,"Elf Shield","Ignore the first blow each turn (unless the attack was a natural 6 to hit)",500]
[15,"Cloak of Lorien","Ignore the first wound caused by each attack.  Roll a D6 each time it protects, a 1 = cloak is destroyed",75]
[16,"Kingshield of Tilea","+1 toughness, once per adventure negates any one blow.","200"]
[17,"Fur Cloak","+1 toughness, roll a D6 each time it protects: 1-3 = destroyed.","75"]
[18,"Boots of Quargskin","1x per adventure can double movement (cannot be sold)",0]
[19,"Cloak of Deception","All attacks on the warrior are –1 to hit, but if a natural 6 is rolled to hit, the magic is exhausted until next adventure.",350]
[20,"Boots of Battle","Gives an additional kick attack of –1 to hit, +1 STR",200]
[21,"Bladed Boots","Gives an additional kick attack of –1 to hit, +1 STR",200]
[22,"Vambraces of Lightning","Gives 4+ dodge versus missile weapons",250]
[23,"Boots of Leaping","Leap 1 square in any direction, ignoring any obstacles, but still counting as 1 move, can only be used once per turn.",400]
[24,"Cloak of Warding","1 armor, can cast spells with this on",200]
[25,"Helmet of Farseeing","+1 toughness, can see as if he had the lantern","800"]
[26,"Boots of Tzchak","+1 move, ignore movement penalties of armor","100"]
[27,"Grey Armor of Eshkalon","Each attack, roll a D6: 1 = armor shatters and is useless, 2-6 = armor absorbs as many wounds as rolled",400]
[28,"Cloak of Shadows","Gives Magic Resistance 4+, if the wearer is selected for a missile attack, return and reselect, taking the second choice",400]
[29,"Elf Helm","+1 Toughness.  In addition, can take a blow on the helm, roll D6: 1 = absorbs all damage and is destroyed, 2-4 = no extra effect, 5-6 = blow does no damage","750"]
[30,"Belt of Blocking","Each blow that the wearer sustains, roll a D6:  1-2 = no effect, 3-5 = 2 wounds less taken 6 = ignores the blow.",500]
[31,"Helm of the Dragonslayer","Immune to all breath weapon attacks of any kind",500]
[32,"Bohemond’s Shield","+1 toughness, Roll a D6 each blow, on a 6, the weapon is broken and destroyed","500"]
[33,"Grail Shield","+1 toughness, all undead are at –1 attack on the bearer","300"]
[34,"Enchanted Shield","If used, roll a D6: 1 = explodes for D6 wounds to user, no modifiers, 5-6 = absorbs all damage.",450]
[35,"Pelt of Charandis","+1 Toughness, +1 more against hand to hand attacks, negates poison effects","450"]
[36,"Helm of Yvresse","+1 toughness, may Re-roll a failed fear or terror test","300"]
[1,"Sword of Defiance","+3 toughness when wielded","600"]
[2,"Sword of Ensorcelled Iron","+1 to hit","150"]
[3,"Biting Blade","Ignores 1 point of armor",150]
[4,"Blade of Leaping Copper","+1 attack","300"]
{"$rows_left_out":69}
{"sheet":"ObjectiveTreasure","index":4,"n_rows":73,"n_cols":4,"rows_kept":73,"cut":false,"hidden":true,"merged":[]}
[]
[1,"Lifestone of Ashraz","As long as the bearer is above 0 wounds, the lifestone heals D3 wounds at the beginning of each turn.",1500]
[2,"Warningstone of Asuryan","Negates ambush on a roll of 6, once per event.",1100]
[3,"Warpjump Spell Jewel","The jewel’s bearer and all adjacent Warriors are transported to any place in the dungeon that they have been to before, once per adventure.",750]
[4,"Wand of Jade","Has 2D6 charges when found.  Each charge increases the effect (not success chance) of a spell by +2.",600]
[5,"Wand of Diabolum","All spells cast with this wand are at –1 Casting number.",500]
[6,"Sceptre of Zandri","Acts as a normal sword (D6+strength damage), but against undead does an additional D6 damage, and all undead are –2 to hit the wielder.",1000]
[7,"Horn of Vengeance","Once per adventure, roll a D6 for every monster on the tile.  If the roll is a natural 6 or is greater than the monster’s toughness, it is hurled to the floor and suffers D6 wounds with no armor.  Prone monsters take a turn to stand up and can do nothing else.",1000]
[8,"Chalice of Battle","Once per adventure, the warrior gains one turn of +1 Attack, +1 to hit, and +1 Strength.",1000]
[9,"Firestorm Icon","Once per adventure, does 6D6 with no modifiers of any kind to all models in a 2x2 square area in line of sight.  ",2000]
[10,"Horn of Defiance","Once per adventure, when blown the effects last until the combat ends or POW rolls 1, whichever comes first.  When a warrior is attacked, on a 6+ no damage is done.",750]
[11,"A set of Gauntlets of Damzhar","This cannot be found if one or more of the Gauntlets is already possessed. When worn, the Gauntlets grant +3 attacks, at +1 to hit and 4D6 damage.",1000]
[12,"Chalice of Sorcery","Gives POW for casting spells.  For each point of POW drawn from the chalice, roll a D6.  All power must be drawn at once, and thus all D6 rolled at the same time.  When the dice are rolled, any 1s that result causes 1D6 wounds, with no modifiers of any kind.",700]
[13,"Enchanted Jade Amulet","Each turn, the amulet will regenerate up to BL in wounds if used, but will not raise wounds over starting level.  Each turn used, roll a D6: \n1 = The amulet crumbles to dust, causing D6 wounds with no modifiers for armor or toughness.  2 = no effect this turn, 3-6 = regenerates.  Does not work at 0 wounds.",600]
[14,"Book of Arcane Knowledge","Roll 4D6 when found, and select spells that are written in the book as if learning new spells.  Each spell can be cast once at no POW cost, then the page crumbles.",1000]
[15,"Brooch of Power","Stores unused POW for the turn, up to (6+BL) total.  If any Power is stored in the Brooch, it gives +1 toughness to the bearer.",1000]
[16,"Dawnstone","Revives a warrior to full wounds even if reduced to 0 wounds or dead, at the end of the turn, then crumbles to dust.",500]
[17,"Crown of Sorcery","Usable only by non-spell casters.  When found, randomly select two spells at the bearers BL in casting number.  Each turn the wearer gains the POW of the dungeon, +1, and can cast up to his BL in spells in a turn.  Each time a spell is cast, roll a D6: 1 = spell fails and wearer is immobilized for the turn (only a 1 misses).",1000]
[18,"Talisman of Obsidian","Gives Magic Drain of 4+ to any adjacent spell caster.  The magic power is redirected to heal 1D6 wounds to the wearer.",500]
[19,"Tablet of Adain","Lets the Wizard re-roll any number of the dice rolled when new spells are learned, but the second result must be taken.",1000]
[20,"Staff of Command","Once per event, a spell caster can attempt to control one monster on the board for a turn.  Roll a D6: 1-4 = no effect, 5-6 = Monster is controlled.  Controlled monsters fight in warrior phase and will do anything ordered except harm its self",900]
[21,"Ring of Cheshnakk","Transports the wearer out of the adventure and to the next settlement the other Warriors visit.",1000]
[22,"Golden Scepter of Norgrim","Once per turn, can add one of the following to all adjacent Warriors: +1 move, +1 STR, +1 Toughness.",800]
[23,"Gauntlet of Bazhrakk the Cruel","+2 Strength.  On a natural 1 to hit, the attack hits an adjacent warrior instead of the monster intended.  Any weapon held is treated as magical, bearer cannot be disarmed.","750"]
[24,"Staff of Flaming Death","Fires flaming skulls in a straight line, first target is hit for 2D6 wounds and causes fear 5+ (D6 plus dungeon level).  Each time it is used, roll a D6: 1 = all charges used up, destroyed, 2-6 = still at least one charge left.",800]
[25,"Staff of Lightning","Does D6+6 damage to the first target in a line, with no modifiers for armor.  Each time it is used, roll a D6: 1 = all charges used up, destroyed, 2-6 = still at least one charge left.",800]
[26,"Staff of Osiris","Does D6+3 to every model in a straight line, ignoring armor.  Each time it is used, roll a D6: 1 = all charges used up, destroyed, 2-6 = still at least one charge left.",800]
[27,"Skull Wand of Kaloth","Used like a sword (Dice plus Strength damage) but each target must make an Initiative check (D6 roll plus initiative, roll 7+) or it dies on the spot.  Has D6 charges, cannot be recharged.","300/charge"]
[28,"Skull Staff","All spells cost 1 less POW to use.  All monsters have –1 to Magic Resistance checks against your spells.  Once per adventure a spell can be cast that ignores all magic resistance, dispels, etc.",2000]
[29,"Rod of Power","Can store Unused POW.  Each turn, roll a D6+Initiative, if the result is less than the POW stored in the Rod, it has leaked the stored Power and is empty.  When any POW is in the staff it gives +1 WS.",1500]
[30,"Forbidden Rod","Can cast spells for no POW cost, but each time roll a D6: 1-3 = Rod uses Wounds in place of the Power cost, 4-6 = no Power required.  No spell cast with the Rod can be dispelled, countered, or resisted.  Each time it is used, roll a D6: 1-2 = all charges used up, destroyed, 3-6 = still at least one charge left.",1500]
[31,"Horn of Panic","Once per combat the Horn can be blown, taking that Warrior’s entire turn.  Roll an initiative check (D6+Initiative, roll 7+ to succeed) for each non-undead creature on the tile.  Each creature that fails fears the party (-1 to hit, -1 to roll on spell chart and –1 spell cast, minimum 1 per turn).",2000]
[32,"Staff of Cyeos","May roll 2D6 for Power each turn and take the best of the two rolls.  If either a 1 or 2 comes up on both of the POW dice, however, there is an unexpected event.",1000]
[33,"Shadow Crown","All attacks are –1 to hit the wearer, who cannot be pinned, and has +2 to movement.",1000]
[34,"Rune Staff","The Rune Staff allows a Warrior to remove a rune from one item and move it to another.  Each try roll a D6: 1  = the rune is destroyed, 2-6 = the rune is successfully moved.",800]
[35,"Cape of Cornwall","Can walk over any pit or trap without setting them off: the character cannot be chosen randomly for a trap (remove him from the characters to pick from a cup).",750]
[36,"Codex of the Magus","Roll 2D6 and pick spells as if learning them for a mage.  These spells are written in the Codex, and any Spell Caster can learn them between adventures.","200/ spell"]
[37,"Sword of Hoeth","When used, roll D6: 1 = trip, lose all attacks this turn, 2-4 = as normal, 5-6 = double attacks",750]
[38,"Hellfire Sword","On a natural roll of 6, does (D6+1 per BL) damage to all adjacent models with no modifiers for toughness or armor",1500]
[39,"Bane Sword","Randomly determine a monster type (dragon, goblin, dark elf, etc) for the dungeon level.  The sword does x2 damage against such monsters",500]
{"$rows_left_out":33}